Reaction Details
TargetCarbonic anhydrase 5A, mitochondrial
LigandBDBM16665
Substrate/CompetitorBDBM10856
Meas. Tech.Esterase Assay
Ki 20±n/a nM
Citation Vullo, DFranchi, MGallori, EAntel, JScozzafava, ASupuran, CT Carbonic anhydrase inhibitors. Inhibition of mitochondrial isozyme V with aromatic and heterocyclic sulfonamides. J Med Chem47:1272-9 (2004) 
 
Carbonic anhydrase 5A, mitochondrial
Name:Carbonic anhydrase 5A, mitochondrial
Type:Enzyme
Mol. Mass.:34081.17
Organism:Mus musculus (mouse)
Description:Full length murine, cloned isozyme.
Residue:299
BDBM16665
BDBM10856
NameBDBM16665
Synonyms:2-oxo-N-[(4-sulfamoylphenyl)methyl]-2H-chromene-3-carboxamide aromatic sulfonamide compound 30
TypeSmall organic molecule
Emp. Form.C17H14N2O5S
Mol. Mass.358.368
SMILESNS(=O)(=O)c1ccc(CNC(=O)c2cc3ccccc3oc2=O)cc1