Reaction Details
TargetTyrosine-protein kinase BTK
LigandBDBM350336
Substrate/Competitorn/a
Meas. Tech.Inhibition Assay
IC50<2.51±n/a nM
Citation Lawson, JDSabat, MScorah, NSmith, CVu, PHWang, H Pyridinyl and fused pyridinyl triazolone derivatives US Patent US9801872 Publication Date 10/31/2017
 
Tyrosine-protein kinase BTK
Name:Tyrosine-protein kinase BTK
Type:Enzyme
Mol. Mass.:76289.95
Organism:Homo sapiens (Human)
Description:Q06187
Residue:659
BDBM350336
NameBDBM350336
Synonyms:3-(1-(((3R,4S)-1-acryloyl-4-methylpyrrolidin-3-yl)oxy)isoquinolin-3-yl)-1H-1,2,4-triazol-5(4H)-one US9801872, Example 20
TypeSmall organic molecule
Emp. Form.C19H19N5O3
Mol. Mass.365.3859
SMILESC[C@H]1CN(C[C@@H]1Oc1nc(cc2ccccc12)-c1n[nH]c(=O)[nH]1)C(=O)C=C