Reaction Details
TargetUbiquitin carboxyl-terminal hydrolase 1/WD repeat-containing protein 48
LigandBDBM350356
Substrate/Competitorn/a
Meas. Tech.Inhibition Assay
IC50 3000±n/a nM
Citation Maloney, DJRosenthal, ASJadhav, ADexheimer, TSSimeonov, AZhuang, ZLiang, QLuci, DK Inhibitors of the USP1/UAF1 deubiquitinase complex and uses thereof US Patent US9802904 Publication Date 10/31/2017
 
Ubiquitin carboxyl-terminal hydrolase 1/WD repeat-containing protein 48
Name:Ubiquitin carboxyl-terminal hydrolase 1/WD repeat-containing protein 48
Type:Protein
Mol. Mass.:n/a
Description:n/a
Components:This complex has 2 components.
Component 1
Name:WD repeat-containing protein 48
Synonyms:KIAA1449 USP1-associated factor 1 WD repeat endosomal protein WDR48 p80
Type:PROTEIN
Mol. Mass.:76215.66
Organism:Homo sapiens (Human)
Description:ChEMBL_109642
Residue:677
Component 2
Name:Ubiquitin carboxyl-terminal hydrolase 1
Synonyms:Deubiquitinating enzyme 1 USP1 Ubiquitin thioesterase 1 hUBP
Type:PROTEIN
Mol. Mass.:88191.62
Organism:Homo sapiens (Human)
Description:ChEMBL_104169
Residue:785
BDBM350356
NameBDBM350356
Synonyms:US9802904, 8
TypeSmall organic molecule
Emp. Form.C23H18F3N3O
Mol. Mass.409.4037
SMILESCOc1ccc(CNc2cccc3nc(ncc23)-c2ccccc2C(F)(F)F)cc1