Reaction Details
TargetTyrosine-protein kinase BTK
LigandBDBM165334
Substrate/Competitorn/a
Meas. Tech.Enzyme Assay
IC50 0.060±n/a nM
Citation Liu, QWatterson, SHAhmad, STebben, AJ Indole carboxamide compounds US Patent US9802915 Publication Date 10/31/2017
 
Tyrosine-protein kinase BTK
Name:Tyrosine-protein kinase BTK
Type:Enzyme
Mol. Mass.:76289.95
Organism:Homo sapiens (Human)
Description:Q06187
Residue:659
BDBM165334
NameBDBM165334
Synonyms:US10604504, Example 128 US9688629, 128 US9920031, Example 128
TypeSmall organic molecule
Emp. Form.C22H27FN4O2
Mol. Mass.398.4738
SMILESCCCC#CC(=O)N[C@H]1CCCN(C1)c1c(F)cc(C(N)=O)c2[nH]c(C)c(C)c12