Reaction Details
TargetTyrosine-protein kinase BTK
LigandBDBM165511
Substrate/Competitorn/a
Meas. Tech.Enzyme Assay
IC50 0.040±n/a nM
Citation Liu, QWatterson, SHAhmad, STebben, AJ Indole carboxamide compounds US Patent US9802915 Publication Date 10/31/2017
 
Tyrosine-protein kinase BTK
Name:Tyrosine-protein kinase BTK
Type:Enzyme
Mol. Mass.:76289.95
Organism:Homo sapiens (Human)
Description:Q06187
Residue:659
BDBM165511
NameBDBM165511
Synonyms:US10604504, Example 168 US9688629, 167 US9802915, Example 168 | US9920031, Example 168
TypeSmall organic molecule
Emp. Form.C20H23FN4O2
Mol. Mass.370.4206
SMILESCc1[nH]c2c(cc(F)c(N3CC4CCN(C4C3)C(=O)C=C)c2c1C)C(N)=O