Reaction Details
TargetBeta-secretase 1
LigandBDBM352244
Substrate/Competitorn/a
Meas. Tech.HTRF FRET Assay
Ki 18.0±n/a nM
Citation Scott, JDCumming, JNBlizzard, TEllis, M C-6 spirocarbocyclic iminothiadiazine dioxides as BACE inhibitors, compositions, and their use US Patent US9802928 Publication Date 10/31/2017
 
Beta-secretase 1
Name:Beta-secretase 1
Type:Protein
Mol. Mass.:55755.10
Organism:Homo sapiens (Human)
Description:P56817
Residue:501
BDBM352244
NameBDBM352244
Synonyms:US9802928, 1a
TypeSmall organic molecule
Emp. Form.C20H22FN5O4S
Mol. Mass.447.483
SMILESCOc1ccc(nc1)C(=O)Nc1ccc(F)c(c1)[C@@]1(C)NC(=N)N(C)S(=O)(=O)C11CC1