Reaction Details
TargetBeta-secretase 1
LigandBDBM352253
Substrate/Competitorn/a
Meas. Tech.HTRF FRET Assay
Ki 47.0±n/a nM
Citation Scott, JDCumming, JNBlizzard, TEllis, M C-6 spirocarbocyclic iminothiadiazine dioxides as BACE inhibitors, compositions, and their use US Patent US9802928 Publication Date 10/31/2017
 
Beta-secretase 1
Name:Beta-secretase 1
Type:Protein
Mol. Mass.:55755.10
Organism:Homo sapiens (Human)
Description:P56817
Residue:501
BDBM352253
NameBDBM352253
Synonyms:US9802928, 1i
TypeSmall organic molecule
Emp. Form.C19H18F4N6O3S
Mol. Mass.486.443
SMILESCN1C(=N)N[C@](C)(c2cc(NC(=O)c3ncc(cn3)C(F)(F)F)ccc2F)C2(CC2)S1(=O)=O