Reaction Details
TargetBeta-secretase 2
LigandBDBM352254
Substrate/Competitorn/a
Meas. Tech.HTRF Assay
Ki 10.00±n/a nM
Citation Scott, JDCumming, JNBlizzard, TEllis, M C-6 spirocarbocyclic iminothiadiazine dioxides as BACE inhibitors, compositions, and their use US Patent US9802928 Publication Date 10/31/2017
 
Beta-secretase 2
Name:Beta-secretase 2
Type:Protein
Mol. Mass.:56171.20
Organism:Homo sapiens (Human)
Description:Q9Y5Z0
Residue:518
BDBM352254
NameBDBM352254
Synonyms:US9802928, 1j
TypeSmall organic molecule
Emp. Form.C21H24FN5O4S
Mol. Mass.461.51
SMILESCOc1cnc(C(=O)Nc2ccc(F)c(c2)[C@@]2(C)NC(=N)N(C)S(=O)(=O)C22CC2)c(C)c1