Reaction Details
TargetBeta-secretase 2
LigandBDBM352255
Substrate/Competitorn/a
Meas. Tech.HTRF Assay
Ki 5.00±n/a nM
Citation Scott, JDCumming, JNBlizzard, TEllis, M C-6 spirocarbocyclic iminothiadiazine dioxides as BACE inhibitors, compositions, and their use US Patent US9802928 Publication Date 10/31/2017
 
Beta-secretase 2
Name:Beta-secretase 2
Type:Protein
Mol. Mass.:56171.20
Organism:Homo sapiens (Human)
Description:Q9Y5Z0
Residue:518
BDBM352255
NameBDBM352255
Synonyms:US9802928, 1k
TypeSmall organic molecule
Emp. Form.C21H21FN6O3S
Mol. Mass.456.493
SMILESCN1C(=N)N[C@](C)(c2cc(NC(=O)c3ncc(cc3C)C#N)ccc2F)C2(CC2)S1(=O)=O