Reaction Details
TargetPhosphatidylinositol 3-kinase catalytic subunit type 3
LigandBDBM338054
Substrate/Competitorn/a
Meas. Tech.Enzyme Assay
IC50<10±n/a nM
Citation Bharathan, ITBlackburn, CCiavarri, JPChouitar, JCullis, CAD Amore, NFleming, PEGigstad, KMGipson, KEGirard, MHu, YLee, JLi, GRezaei, MSintchak, MDSoucy, FStroud, SGVos, TJWong, TXu, HXu, TYe, Y Heteroaryls and uses thereof US Patent US9802960 Publication Date 10/31/2017
 
Phosphatidylinositol 3-kinase catalytic subunit type 3
Name:Phosphatidylinositol 3-kinase catalytic subunit type 3
Type:Enzyme
Mol. Mass.:101551.30
Organism:Homo sapiens (Human)
Description:Recombinant human Vps34 protein was expressed as monomeric GST-fusion and purified.
Residue:887
BDBM338054
NameBDBM338054
Synonyms:US9751854, Compound I-229 | US9802960, Compound I-229
TypeSmall organic molecule
Emp. Form.C20H21N7O2S
Mol. Mass.423.491
SMILESCN(C)S(=O)(=O)Nc1cc(cnc1C)-c1ccnc(Nc2ccc(C#N)c(C)n2)c1