Reaction Details
TargetCoagulation factor IX
LigandBDBM352464
Substrate/Competitorn/a
Meas. Tech.Factor XIa Assay
Ki<5.00±n/a nM
Citation Ogawa, AEdmondson, SErion, MNeelamkavil, SGuo, ZMal, RHe, JLiu, WVande Bunte, EK Factor XIa inhibitors US Patent US9809545 Publication Date 11/7/2017
 
Coagulation factor IX
Name:Coagulation factor IX
Type:Enzyme
Mol. Mass.:51768.83
Organism:Homo sapiens (Human)
Description:P00740
Residue:461
BDBM352464
NameBDBM352464
Synonyms:US9809545, 3g
TypeSmall organic molecule
Emp. Form.C28H20ClN7O3
Mol. Mass.537.957
SMILESOC(=O)c1ccc2[nH]c(nc2c1)[C@H](Cc1ccccc1)n1ccc(cc1=O)-c1cc(Cl)ccc1-n1cnnn1