Reaction Details
TargetCoagulation factor IX
LigandBDBM352474
Substrate/Competitorn/a
Meas. Tech.Factor XIa Assay
Ki 54.0±n/a nM
Citation Ogawa, AEdmondson, SErion, MNeelamkavil, SGuo, ZMal, RHe, JLiu, WVande Bunte, EK Factor XIa inhibitors US Patent US9809545 Publication Date 11/7/2017
 
Coagulation factor IX
Name:Coagulation factor IX
Type:Enzyme
Mol. Mass.:51768.83
Organism:Homo sapiens (Human)
Description:P00740
Residue:461
BDBM352474
NameBDBM352474
Synonyms:US9809545, 4Bp
TypeSmall organic molecule
Emp. Form.C29H22ClFN8O
Mol. Mass.552.989
SMILESCc1cncc(c1)-c1cnc([nH]1)[C@H](Cc1ccc(F)cc1)n1ccc(cc1=O)-c1cc(Cl)ccc1-n1cnnn1