Reaction Details
TargetCoagulation factor X
LigandBDBM17087
Substrate/CompetitorBDBM12658
Meas. Tech.Enzyme Inhibition Assay
pH7.5±n/a
Temperature295.15±n/a K
Ki 0.43±n/a nM
Citation Ye, BArnaiz, DOChou, YLGriedel, BDKaranjawala, RLee, WMorrissey, MMSacchi, KLSakata, STShaw, KJWu, SCZhao, ZAdler, MCheeseman, SDole, WPEwing, JFitch, RLentz, DLiang, ALight, DMorser, JPost, JRumennik, GSubramanyam, BSullivan, MEVergona, RWalters, JWang, YXWhite, KAWhitlow, MKochanny, MJ Thiophene-anthranilamides as highly potent and orally available factor xa inhibitors J Med Chem50:2967-80 (2007) 
 
Coagulation factor X
Name:Coagulation factor X
Type:Enzyme
Mol. Mass.:54726.60
Organism:Homo sapiens (Human)
Description:n/a
Residue:488
BDBM17087
BDBM12658
NameBDBM17087
Synonyms:3-chloro-N-{4-chloro-2-[(4-chlorophenyl)carbamoyl]-6-methoxyphenyl}-4-[(4-methylpiperazin-1-yl)methyl]thiophene-2-carboxamide | Thiophene-Anthranilamide, 3b
TypeSmall organic molecule
Emp. Form.C25H25Cl3N4O3S
Mol. Mass.567.915
SMILESCOc1cc(Cl)cc(C(=O)Nc2ccc(Cl)cc2)c1NC(=O)c1scc(CN2CCN(C)CC2)c1Cl