Reaction Details
TargetCoagulation factor X
LigandBDBM17108
Substrate/CompetitorBDBM12658
Meas. Tech.Enzyme Inhibition Assay
Ki 0.050±n/a nM
Citation Ye, BArnaiz, DOChou, YLGriedel, BDKaranjawala, RLee, WMorrissey, MMSacchi, KLSakata, STShaw, KJWu, SCZhao, ZAdler, MCheeseman, SDole, WPEwing, JFitch, RLentz, DLiang, ALight, DMorser, JPost, JRumennik, GSubramanyam, BSullivan, MEVergona, RWalters, JWang, YXWhite, KAWhitlow, MKochanny, MJ Thiophene-anthranilamides as highly potent and orally available factor xa inhibitors J Med Chem50:2967-80 (2007) 
 
Coagulation factor X
Name:Coagulation factor X
Type:Enzyme
Mol. Mass.:54726.60
Organism:Homo sapiens (Human)
Description:n/a
Residue:488
BDBM17108
BDBM12658
NameBDBM17108
Synonyms:3-chloro-N-{4-chloro-2-[(5-chloropyridin-2-yl)carbamoyl]-6-methoxyphenyl}-4-({[(2-hydroxyethyl)carbamoyl](methyl)amino}methyl)thiophene-2-carboxamide | Thiophene-Anthranilamide, 12d
TypeSmall organic molecule
Emp. Form.C23H22Cl3N5O5S
Mol. Mass.586.875
SMILESCOc1cc(Cl)cc(C(=O)Nc2ccc(Cl)cn2)c1NC(=O)c1scc(CN(C)C(=O)NCCO)c1Cl