Reaction Details
TargetCoagulation factor X
LigandBDBM17110
Substrate/CompetitorBDBM12658
Meas. Tech.Enzyme Inhibition Assay
Ki 0.022±n/a nM
Citation Ye, BArnaiz, DOChou, YLGriedel, BDKaranjawala, RLee, WMorrissey, MMSacchi, KLSakata, STShaw, KJWu, SCZhao, ZAdler, MCheeseman, SDole, WPEwing, JFitch, RLentz, DLiang, ALight, DMorser, JPost, JRumennik, GSubramanyam, BSullivan, MEVergona, RWalters, JWang, YXWhite, KAWhitlow, MKochanny, MJ Thiophene-anthranilamides as highly potent and orally available factor xa inhibitors J Med Chem50:2967-80 (2007) 
 
Coagulation factor X
Name:Coagulation factor X
Type:Enzyme
Mol. Mass.:54726.60
Organism:Homo sapiens (Human)
Description:n/a
Residue:488
BDBM17110
BDBM12658
NameBDBM17110
Synonyms:3-[({[4-chloro-5-({4-chloro-2-[(5-chloropyridin-2-yl)carbamoyl]-6-methoxyphenyl}carbamoyl)thiophen-3-yl]methyl}(methyl)carbamoyl)amino]propanoic acid | Thiophene-Anthranilamide, 12f
TypeSmall organic molecule
Emp. Form.C24H22Cl3N5O6S
Mol. Mass.614.885
SMILESCOc1cc(Cl)cc(C(=O)Nc2ccc(Cl)cn2)c1NC(=O)c1scc(CN(C)C(=O)NCCC(O)=O)c1Cl