Reaction Details
TargetCoagulation factor X
LigandBDBM17119
Substrate/CompetitorBDBM12658
Meas. Tech.Enzyme Inhibition Assay
Ki 0.026±n/a nM
Citation Ye, BArnaiz, DOChou, YLGriedel, BDKaranjawala, RLee, WMorrissey, MMSacchi, KLSakata, STShaw, KJWu, SCZhao, ZAdler, MCheeseman, SDole, WPEwing, JFitch, RLentz, DLiang, ALight, DMorser, JPost, JRumennik, GSubramanyam, BSullivan, MEVergona, RWalters, JWang, YXWhite, KAWhitlow, MKochanny, MJ Thiophene-anthranilamides as highly potent and orally available factor xa inhibitors J Med Chem50:2967-80 (2007) 
 
Coagulation factor X
Name:Coagulation factor X
Type:Enzyme
Mol. Mass.:54726.60
Organism:Homo sapiens (Human)
Description:n/a
Residue:488
BDBM17119
BDBM12658
NameBDBM17119
Synonyms:3-chloro-N-{4-chloro-2-[(5-chloropyridin-2-yl)carbamoyl]-6-methoxyphenyl}-4-{[methyl(4-oxo-4,5-dihydro-1,3-oxazol-2-yl)amino]methyl}thiophene-2-carboxamide | Thiophene-Anthranilamide, 13i
TypeSmall organic molecule
Emp. Form.C23H18Cl3N5O5S
Mol. Mass.582.844
SMILESCOc1cc(Cl)cc(C(=O)Nc2ccc(Cl)cn2)c1NC(=O)c1scc(CN(C)c2nc(O)co2)c1Cl