Reaction Details
TargetCoagulation factor X
LigandBDBM17126
Substrate/CompetitorBDBM12658
Meas. Tech.Enzyme Inhibition Assay
Ki 0.034±n/a nM
Citation Ye, BArnaiz, DOChou, YLGriedel, BDKaranjawala, RLee, WMorrissey, MMSacchi, KLSakata, STShaw, KJWu, SCZhao, ZAdler, MCheeseman, SDole, WPEwing, JFitch, RLentz, DLiang, ALight, DMorser, JPost, JRumennik, GSubramanyam, BSullivan, MEVergona, RWalters, JWang, YXWhite, KAWhitlow, MKochanny, MJ Thiophene-anthranilamides as highly potent and orally available factor xa inhibitors J Med Chem50:2967-80 (2007) 
 
Coagulation factor X
Name:Coagulation factor X
Type:Enzyme
Mol. Mass.:54726.60
Organism:Homo sapiens (Human)
Description:n/a
Residue:488
BDBM17126
BDBM12658
NameBDBM17126
Synonyms:3-chloro-N-{4-chloro-2-[(5-chloropyridin-2-yl)carbamoyl]-6-methoxyphenyl}-4-[(2-imino-4-oxoimidazolidin-1-yl)methyl]thiophene-2-carboxamide | Thiophene-Anthranilamide, 17d
TypeSmall organic molecule
Emp. Form.C22H17Cl3N6O4S
Mol. Mass.567.832
SMILESCOc1cc(Cl)cc(C(=O)Nc2ccc(Cl)cn2)c1NC(=O)c1scc(Cn2cc(O)nc2N)c1Cl