Reaction Details
TargetProthrombin
LigandBDBM17123
Substrate/CompetitorBDBM12680
Meas. Tech.Enzyme Inhibition Assay
Ki 1100±n/a nM
Citation Ye, BArnaiz, DOChou, YLGriedel, BDKaranjawala, RLee, WMorrissey, MMSacchi, KLSakata, STShaw, KJWu, SCZhao, ZAdler, MCheeseman, SDole, WPEwing, JFitch, RLentz, DLiang, ALight, DMorser, JPost, JRumennik, GSubramanyam, BSullivan, MEVergona, RWalters, JWang, YXWhite, KAWhitlow, MKochanny, MJ Thiophene-anthranilamides as highly potent and orally available factor xa inhibitors J Med Chem50:2967-80 (2007) 
 
Prothrombin
Name:Prothrombin
Type:Protein
Mol. Mass.:70029.57
Organism:Homo sapiens (Human)
Description:P00734
Residue:622
BDBM17123
BDBM12680
NameBDBM17123
Synonyms:3-chloro-N-{4-chloro-2-[(5-chloropyridin-2-yl)carbamoyl]-6-methoxyphenyl}-4-[(2-imino-1,3-oxazolidin-3-yl)methyl]thiophene-2-carboxamide | Thiophene-Anthranilamide, 17a
TypeSmall organic molecule
Emp. Form.C22H18Cl3N5O4S
Mol. Mass.554.833
SMILESCOc1cc(Cl)cc(C(=O)Nc2ccc(Cl)cn2)c1NC(=O)c1scc(CN2CCOC2=N)c1Cl