Reaction Details
TargetProthrombin
LigandBDBM17127
Substrate/CompetitorBDBM12680
Meas. Tech.Enzyme Inhibition Assay
Ki 2200±n/a nM
Citation Ye, BArnaiz, DOChou, YLGriedel, BDKaranjawala, RLee, WMorrissey, MMSacchi, KLSakata, STShaw, KJWu, SCZhao, ZAdler, MCheeseman, SDole, WPEwing, JFitch, RLentz, DLiang, ALight, DMorser, JPost, JRumennik, GSubramanyam, BSullivan, MEVergona, RWalters, JWang, YXWhite, KAWhitlow, MKochanny, MJ Thiophene-anthranilamides as highly potent and orally available factor xa inhibitors J Med Chem50:2967-80 (2007) 
 
Prothrombin
Name:Prothrombin
Type:Protein
Mol. Mass.:70029.57
Organism:Homo sapiens (Human)
Description:P00734
Residue:622
BDBM17127
BDBM12680
NameBDBM17127
Synonyms:3-chloro-N-{4-chloro-2-[(5-chloropyridin-2-yl)carbamoyl]-6-methoxyphenyl}-4-{[2-(methylsulfanyl)-4,5-dihydro-1H-imidazol-1-yl]methyl}thiophene-2-carboxamide | Thiophene-Anthranilamide, 17e
TypeSmall organic molecule
Emp. Form.C23H20Cl3N5O3S2
Mol. Mass.584.926
SMILESCOc1cc(Cl)cc(C(=O)Nc2ccc(Cl)cn2)c1NC(=O)c1scc(CN2CCN=C2SC)c1Cl