Reaction Details
TargetApoptosis regulator Bcl-2
LigandBDBM354619
Substrate/Competitorn/a
Meas. Tech.Fluorescence Polarisation Assay
IC50 2.20±n/a nM
Citation Davidson, JEMurray, JBChen, IWalmsley, CDodsworth, MMeissner, JWBrough, PFejes, ITatai, JNyerges, MKotschy, ASzlávik, ZGeneste, OLe Tiran, ALe Diguarher, THenlin, JStarck, JGuillouzic, ADe Nanteuil, G Isoindoline or isoquinoline compounds, a process for their preparation and pharmaceutical compositions containing them US Patent US9809574 Publication Date 11/7/2017
 
Apoptosis regulator Bcl-2
Name:Apoptosis regulator Bcl-2
Type:Homodimer or heterodimer
Mol. Mass.:26269.11
Organism:Homo sapiens (Human)
Description:P10415
Residue:239
BDBM354619
NameBDBM354619
Synonyms:3-(6-{4-[(4-Hydroxyphenyl)(methyl)carbamoyl]-1,5-dimethyl-1H-pyrrol-2-yl}-7-[(3R)-3-methyl-1,2,3,4-tetrahydroisoquinoline-2-carbonyl]-1,2,3,4-tetrahydroisoquinoline-2-carbonyloxy)benzoic acid | US9809574, Example 715
TypeSmall organic molecule
Emp. Form.C42H40N4O7
Mol. Mass.712.7896
SMILESC[C@@H]1Cc2ccccc2CN1C(=O)c1cc2CN(CCc2cc1-c1cc(C(=O)N(C)c2ccc(O)cc2)c(C)n1C)C(=O)Oc1cccc(c1)C(O)=O