Reaction Details
TargetApoptosis regulator Bcl-2
LigandBDBM354621
Substrate/Competitorn/a
Meas. Tech.Fluorescence Polarisation Assay
IC50 1.50±n/a nM
Citation Davidson, JEMurray, JBChen, IWalmsley, CDodsworth, MMeissner, JWBrough, PFejes, ITatai, JNyerges, MKotschy, ASzlávik, ZGeneste, OLe Tiran, ALe Diguarher, THenlin, JStarck, JGuillouzic, ADe Nanteuil, G Isoindoline or isoquinoline compounds, a process for their preparation and pharmaceutical compositions containing them US Patent US9809574 Publication Date 11/7/2017
 
Apoptosis regulator Bcl-2
Name:Apoptosis regulator Bcl-2
Type:Homodimer or heterodimer
Mol. Mass.:26269.11
Organism:Homo sapiens (Human)
Description:P10415
Residue:239
BDBM354621
NameBDBM354621
Synonyms:3-(6-{4-[(4-Hydroxyphenyl)(methyl)carbamoyl]-1,5-dimethyl-1H-pyrrol-2-yl}-7-[(3S)-3-[(4-methylpiperazin-1-yl)methyl]-1,2,3,4-tetrahydroisoquinoline-2-carbonyl]-1,2,3,4-tetrahydroisoquinoline-2-carbonyloxy)benzoic acid | US9809574, Example 733
TypeSmall organic molecule
Emp. Form.C47H50N6O7
Mol. Mass.810.9359
SMILESCN(C(=O)c1cc(-c2cc3CCN(Cc3cc2C(=O)N2Cc3ccccc3C[C@H]2CN2CCN(C)CC2)C(=O)Oc2cccc(c2)C(O)=O)n(C)c1C)c1ccc(O)cc1