Reaction Details
TargetApoptosis regulator Bcl-2
LigandBDBM354648
Substrate/Competitorn/a
Meas. Tech.Fluorescence Polarisation Assay
IC50 2.00±n/a nM
Citation Davidson, JEMurray, JBChen, IWalmsley, CDodsworth, MMeissner, JWBrough, PFejes, ITatai, JNyerges, MKotschy, ASzlávik, ZGeneste, OLe Tiran, ALe Diguarher, THenlin, JStarck, JGuillouzic, ADe Nanteuil, G Isoindoline or isoquinoline compounds, a process for their preparation and pharmaceutical compositions containing them US Patent US9809574 Publication Date 11/7/2017
 
Apoptosis regulator Bcl-2
Name:Apoptosis regulator Bcl-2
Type:Homodimer or heterodimer
Mol. Mass.:26269.11
Organism:Homo sapiens (Human)
Description:P10415
Residue:239
BDBM354648
NameBDBM354648
Synonyms:(1r,4r)-4-{[(tert-Butoxy)carbonyl]amino}cyclohexyl 6-{4-[(4-hydroxyphenyl)(methyl)carbamoyl]-1,5-dimethyl-1H-pyrrol-2-yl}-7-[(3R)-3-methyl-1,2,3,4-tetrahydroisoquinoline-2-carbonyl]-1,2,3,4-tetrahydroisoquinoline-2-carboxylate | US9809574, Example 800
TypeSmall organic molecule
Emp. Form.C46H55N5O7
Mol. Mass.789.9582
SMILESC[C@@H]1Cc2ccccc2CN1C(=O)c1cc2CN(CCc2cc1-c1cc(C(=O)N(C)c2ccc(O)cc2)c(C)n1C)C(=O)O[C@H]1CC[C@@H](CC1)NC(=O)OC(C)(C)C