Reaction Details
TargetAndrogen receptor
LigandBDBM354694
Substrate/Competitorn/a
Meas. Tech.Binding Assay
IC50 23.9±n/a nM
Citation Choi, SPChoi, SMSon, BHKim, HJKim, JMJang, BJSung, JHLee, JHKim, EKang, KKKim, S Oxazolidine-based compound and selective androgen receptor agonist comprising same US Patent US9809583 Publication Date 11/7/2017
 
Androgen receptor
Name:Androgen receptor
Synonyms:n/a
Type:n/a
Mol. Mass.:97086.15
Organism:Chlorocebus sabaeus (Green monkey) (Cercopithecus sabaeus)
Description:A0A0D9RHK8
Residue:900
BDBM354694
NameBDBM354694
TypeSmall organic molecule
Emp. Form.C21H15F6N3O2
Mol. Mass.455.3531
SMILESFC(F)(F)[C@H]1O[C@H](COCc2ccc(cc2)C#N)CN1c1ccc(C#N)c(c1)C(F)(F)F