Reaction Details
TargetAndrogen receptor
LigandBDBM354695
Substrate/Competitorn/a
Meas. Tech.Binding Assay
IC50 1092±n/a nM
Citation Choi, SPChoi, SMSon, BHKim, HJKim, JMJang, BJSung, JHLee, JHKim, EKang, KKKim, S Oxazolidine-based compound and selective androgen receptor agonist comprising same US Patent US9809583 Publication Date 11/7/2017
 
Androgen receptor
Name:Androgen receptor
Synonyms:n/a
Type:n/a
Mol. Mass.:97086.15
Organism:Chlorocebus sabaeus (Green monkey) (Cercopithecus sabaeus)
Description:A0A0D9RHK8
Residue:900
BDBM354695
NameBDBM354695
TypeSmall organic molecule
Emp. Form.C13H10F6N2O2
Mol. Mass.340.2211
SMILESOC[C@@H]1CN([C@@H](O1)C(F)(F)F)c1ccc(C#N)c(c1)C(F)(F)F