Reaction Details
TargetAndrogen receptor
LigandBDBM354697
Substrate/Competitorn/a
Meas. Tech.Binding Assay
IC50 91.6±n/a nM
Citation Choi, SPChoi, SMSon, BHKim, HJKim, JMJang, BJSung, JHLee, JHKim, EKang, KKKim, S Oxazolidine-based compound and selective androgen receptor agonist comprising same US Patent US9809583 Publication Date 11/7/2017
 
Androgen receptor
Name:Androgen receptor
Synonyms:n/a
Type:n/a
Mol. Mass.:97086.15
Organism:Chlorocebus sabaeus (Green monkey) (Cercopithecus sabaeus)
Description:A0A0D9RHK8
Residue:900
BDBM354697
NameBDBM354697
TypeSmall organic molecule
Emp. Form.C19H16F3N3O4
Mol. Mass.407.3432
SMILESCc1cc(ccc1[N+]([O-])=O)N1C[C@@H](COc2ccc(cc2)C#N)O[C@@H]1C(F)(F)F