Reaction Details
TargetAndrogen receptor
LigandBDBM354711
Substrate/Competitorn/a
Meas. Tech.Binding Assay
IC50 141±n/a nM
Citation Choi, SPChoi, SMSon, BHKim, HJKim, JMJang, BJSung, JHLee, JHKim, EKang, KKKim, S Oxazolidine-based compound and selective androgen receptor agonist comprising same US Patent US9809583 Publication Date 11/7/2017
 
Androgen receptor
Name:Androgen receptor
Synonyms:n/a
Type:n/a
Mol. Mass.:97086.15
Organism:Chlorocebus sabaeus (Green monkey) (Cercopithecus sabaeus)
Description:A0A0D9RHK8
Residue:900
BDBM354711
NameBDBM354711
TypeSmall organic molecule
Emp. Form.C14H9F9N2O2
Mol. Mass.408.2191
SMILESO[C@@H]([C@@H]1CN([C@H](O1)C(F)(F)F)c1ccc(C#N)c(c1)C(F)(F)F)C(F)(F)F