Reaction Details
TargetAndrogen receptor
LigandBDBM354713
Substrate/Competitorn/a
Meas. Tech.Binding Assay
IC50 75.1±n/a nM
Citation Choi, SPChoi, SMSon, BHKim, HJKim, JMJang, BJSung, JHLee, JHKim, EKang, KKKim, S Oxazolidine-based compound and selective androgen receptor agonist comprising same US Patent US9809583 Publication Date 11/7/2017
 
Androgen receptor
Name:Androgen receptor
Synonyms:n/a
Type:n/a
Mol. Mass.:97086.15
Organism:Chlorocebus sabaeus (Green monkey) (Cercopithecus sabaeus)
Description:A0A0D9RHK8
Residue:900
BDBM354713
NameBDBM354713
TypeSmall organic molecule
Emp. Form.C19H13ClF6N2O2
Mol. Mass.450.762
SMILESFC(F)(F)[C@H]1O[C@H](COc2ccc(Cl)cc2)CN1c1ccc(C#N)c(c1)C(F)(F)F