Reaction Details
TargetAndrogen receptor
LigandBDBM354721
Substrate/Competitorn/a
Meas. Tech.Binding Assay
IC50 10.4±n/a nM
Citation Choi, SPChoi, SMSon, BHKim, HJKim, JMJang, BJSung, JHLee, JHKim, EKang, KKKim, S Oxazolidine-based compound and selective androgen receptor agonist comprising same US Patent US9809583 Publication Date 11/7/2017
 
Androgen receptor
Name:Androgen receptor
Synonyms:n/a
Type:n/a
Mol. Mass.:97086.15
Organism:Chlorocebus sabaeus (Green monkey) (Cercopithecus sabaeus)
Description:A0A0D9RHK8
Residue:900
BDBM354721
NameBDBM354721
TypeSmall organic molecule
Emp. Form.C19H12F7N3O4
Mol. Mass.479.3051
SMILES[O-][N+](=O)c1ccc(OC[C@@H]2CN([C@H](O2)C(F)(F)F)c2ccc(C#N)c(c2)C(F)(F)F)c(F)c1