Reaction Details
TargetMitogen-activated protein kinase kinase kinase 11
LigandBDBM50441569
Substrate/Competitorn/a
Meas. Tech.Radiometric Filter Plate Assay
IC50<100±n/a nM
Citation Gelbard, HADewhurst, SGoodfellow, VSLoweth, CJWiemann, T Substituted pyrrolo[2,3-b]pyridines as MLK inhibitors US Patent US9814704 Publication Date 11/14/2017
 
Mitogen-activated protein kinase kinase kinase 11
Name:Mitogen-activated protein kinase kinase kinase 11
Type:PROTEIN
Mol. Mass.:92696.93
Organism:Homo sapiens (Human)
Description:ChEMBL_1460565
Residue:847
BDBM50441569
NameBDBM50441569
Synonyms:CHEMBL2436981 US9814704, Example 4
TypeSmall organic molecule
Emp. Form.C20H15N5
Mol. Mass.325.3666
SMILESNc1ccc(cn1)-c1cnc2[nH]cc(-c3ccc4[nH]ccc4c3)c2c1