Reaction Details
TargetMitogen-activated protein kinase kinase kinase 11
LigandBDBM354748
Substrate/Competitorn/a
Meas. Tech.Radiometric Filter Plate Assay
IC50<100±n/a nM
Citation Gelbard, HADewhurst, SGoodfellow, VSLoweth, CJWiemann, T Substituted pyrrolo[2,3-b]pyridines as MLK inhibitors US Patent US9814704 Publication Date 11/14/2017
 
Mitogen-activated protein kinase kinase kinase 11
Name:Mitogen-activated protein kinase kinase kinase 11
Type:PROTEIN
Mol. Mass.:92696.93
Organism:Homo sapiens (Human)
Description:ChEMBL_1460565
Residue:847
BDBM354748
NameBDBM354748
Synonyms:Preparation of 4-(5-(3,4,5-trimethoxyphenyl)-1H-pyrrolo[2,3-b]pyridin-3-yl)benzamide US9814704, Example 25
TypeSmall organic molecule
Emp. Form.C23H21N3O4
Mol. Mass.403.4305
SMILESCOc1cc(cc(OC)c1OC)-c1cnc2[nH]cc(-c3ccc(cc3)C(N)=O)c2c1