Reaction Details
TargetMitogen-activated protein kinase kinase kinase 11
LigandBDBM354753
Substrate/Competitorn/a
Meas. Tech.Radiometric Filter Plate Assay
IC50<100±n/a nM
Citation Gelbard, HADewhurst, SGoodfellow, VSLoweth, CJWiemann, T Substituted pyrrolo[2,3-b]pyridines as MLK inhibitors US Patent US9814704 Publication Date 11/14/2017
 
Mitogen-activated protein kinase kinase kinase 11
Name:Mitogen-activated protein kinase kinase kinase 11
Type:PROTEIN
Mol. Mass.:92696.93
Organism:Homo sapiens (Human)
Description:ChEMBL_1460565
Residue:847
BDBM354753
NameBDBM354753
Synonyms:US10485800, Example 30 | US9814704, Example 30
TypeSmall organic molecule
Emp. Form.C27H19FN4O2S
Mol. Mass.482.529
SMILESCc1ccc(cc1)S(=O)(=O)n1cc(-c2ccc3[nH]ccc3c2)c2cc(cnc12)-c1ccc(F)nc1