Reaction Details
TargetMitogen-activated protein kinase kinase kinase 11
LigandBDBM354762
Substrate/Competitorn/a
Meas. Tech.Radiometric Filter Plate Assay
IC50<100±n/a nM
Citation Gelbard, HADewhurst, SGoodfellow, VSLoweth, CJWiemann, T Substituted pyrrolo[2,3-b]pyridines as MLK inhibitors US Patent US9814704 Publication Date 11/14/2017
 
Mitogen-activated protein kinase kinase kinase 11
Name:Mitogen-activated protein kinase kinase kinase 11
Type:PROTEIN
Mol. Mass.:92696.93
Organism:Homo sapiens (Human)
Description:ChEMBL_1460565
Residue:847
BDBM354762
NameBDBM354762
Synonyms:Preparation of 4-(2-(4-(7-(1H-indol-5-yl)-5H-pyrrolo[3,2-b]pyrazin-2-yl)-2-methoxyphenoxy)ethyl)morpholine US9814704, Example 39
TypeSmall organic molecule
Emp. Form.C27H27N5O3
Mol. Mass.469.535
SMILESCOc1cc(ccc1OCCN1CCOCC1)-c1cnc2[nH]cc(-c3ccc4[nH]ccc4c3)c2n1