Reaction Details
TargetOxysterols receptor LXR-beta
LigandBDBM155261
Substrate/Competitorn/a
Meas. Tech.Radioligand Binding Assay
Ki 4.00±n/a nM
Citation Dong, CFan, YLeftheris, KLotesta, SDSingh, SBTice, CMZhao, WZheng, YZhuang, L Liver X receptor modulators US Patent US9814715 Publication Date 11/14/2017
 
Oxysterols receptor LXR-beta
Name:Oxysterols receptor LXR-beta
Type:Enzyme Catalytic Domain
Mol. Mass.:50978.79
Organism:Homo sapiens (Human)
Description:P55055
Residue:460
BDBM155261
NameBDBM155261
Synonyms:US9006244, E4a | US9814715, Example 4, isomer 1
TypeSmall organic molecule
Emp. Form.C21H23F3N4O3S
Mol. Mass.468.493
SMILESCC(C)[C@H]1N(CCn2c1cc1cc(CO)c(cc21)S(C)(=O)=O)c1nccc(n1)C(F)(F)F