Reaction Details
TargetIntegrin alpha-4/beta-1 [T112H]
LigandBDBM17188
Substrate/CompetitorBDBM17155
Meas. Tech.Jurkat J6 Scintillation Proximity Assay
pH7.5±n/a
Temperature295.15±n/a K
Ki 25.12±n/a nM
Citation Witherington, JBordas, VGaiba, AGreen, PMNaylor, AParr, NSmith, DGTakle, AKWard, RW Pyridone derivatives as potent and selective VLA-4 integrin antagonists. Bioorg Med Chem Lett16:2256-9 (2006) 
 
Integrin alpha-4/beta-1 [T112H]
Name:Integrin alpha-4/beta-1 [T112H]
Type:Protein Complex
Mol. Mass.:n/a
Description:The assay uses transfected Ramos cells expressing alpha4beta1 integrin.
Components:This complex has 2 components.
Component 1
Name:Integrin alpha-4
Synonyms:CD49 antigen-like family member D CD49d antigen ITA4_HUMAN Integrin alpha-4 Integrin alpha-IV VLA-4 integrin alpha 4 precursor | integrin alpha-4 precursor
Type:Membrane Protein
Mol. Mass.:114897.35
Organism:Homo sapiens (Human)
Description:P13612
Residue:1032
Component 2
Name:Integrin beta-1 [T112H]
Synonyms:CD29 antigen Fibronectin receptor subunit beta ITGB1 Integrin beta1 MSK12
Type:Membrane Protein
Mol. Mass.:88450.95
Organism:Homo sapiens (Human)
Description:P05556[T112H]
Residue:798
BDBM17188
BDBM17155
NameBDBM17188
Synonyms:3-(4-{[3-(3-methoxy-4-{[(2-methylphenyl)carbamoyl]amino}phenyl)-1H-pyrazol-1-yl]methyl}phenyl)propanoic acid | C-ring heterocyclic urea, 5
TypeSmall organic molecule
Emp. Form.C28H28N4O4
Mol. Mass.484.5463
SMILESCOc1cc(ccc1NC(=O)Nc1ccccc1C)-c1ccn(Cc2ccc(CCC(O)=O)cc2)n1