Reaction Details
TargetIntegrin alpha-4/beta-1 [T112H]
LigandBDBM17192
Substrate/CompetitorBDBM17155
Meas. Tech.Jurkat J6 Scintillation Proximity Assay
pH7.5±n/a
Temperature295.15±n/a K
Ki 398.10±n/a nM
Citation Witherington, JBordas, VGaiba, AGreen, PMNaylor, AParr, NSmith, DGTakle, AKWard, RW Pyridone derivatives as potent and selective VLA-4 integrin antagonists. Bioorg Med Chem Lett16:2256-9 (2006) 
 
Integrin alpha-4/beta-1 [T112H]
Name:Integrin alpha-4/beta-1 [T112H]
Type:Protein Complex
Mol. Mass.:n/a
Description:The assay uses transfected Ramos cells expressing alpha4beta1 integrin.
Components:This complex has 2 components.
Component 1
Name:Integrin alpha-4
Synonyms:CD49 antigen-like family member D CD49d antigen ITA4_HUMAN Integrin alpha-4 Integrin alpha-IV VLA-4 integrin alpha 4 precursor | integrin alpha-4 precursor
Type:Membrane Protein
Mol. Mass.:114897.35
Organism:Homo sapiens (Human)
Description:P13612
Residue:1032
Component 2
Name:Integrin beta-1 [T112H]
Synonyms:CD29 antigen Fibronectin receptor subunit beta ITGB1 Integrin beta1 MSK12
Type:Membrane Protein
Mol. Mass.:88450.95
Organism:Homo sapiens (Human)
Description:P05556[T112H]
Residue:798
BDBM17192
BDBM17155
NameBDBM17192
Synonyms:3-(2-{[3-(4-{[(2-methylphenyl)carbamoyl]amino}phenyl)-2-oxo-1,2-dihydropyridin-1-yl]methyl}phenyl)propanoic acid | Pyridone analog, 13
TypeSmall organic molecule
Emp. Form.C29H27N3O4
Mol. Mass.481.5424
SMILESCc1ccccc1NC(=O)Nc1ccc(cc1)-c1cccn(Cc2ccccc2CCC(O)=O)c1=O