Reaction Details
TargetCoagulation factor X
LigandBDBM17226
Substrate/CompetitorBDBM12658
Meas. Tech.Enzyme Inhibition Assay
pH7.5±n/a
Temperature295.15±n/a K
Ki 0.33±n/a nM
Citation Kochanny, MJAdler, MEwing, JGriedel, BDHo, EKaranjawala, RLee, WLentz, DLiang, AMMorrissey, MMPhillips, GBPost, JSacchi, KLSakata, STSubramanyam, BVergona, RWalters, JWhite, KAWhitlow, MYe, BZhao, ZShaw, KJ Substituted thiophene-anthranilamides as potent inhibitors of human factor Xa. Bioorg Med Chem15:2127-46 (2007) 
 
Coagulation factor X
Name:Coagulation factor X
Type:Enzyme
Mol. Mass.:54726.60
Organism:Homo sapiens (Human)
Description:n/a
Residue:488
BDBM17226
BDBM12658
NameBDBM17226
Synonyms:3-chloro-N-{2-[(4-chlorophenyl)carbamoyl]-4-methylphenyl}-1-benzothiophene-2-carboxamide | benzothiophene compound, 2
TypeSmall organic molecule
Emp. Form.C23H16Cl2N2O2S
Mol. Mass.455.356
SMILESCc1ccc(NC(=O)c2sc3ccccc3c2Cl)c(c1)C(=O)Nc1ccc(Cl)cc1