Reaction Details
TargetCoagulation factor X
LigandBDBM17248
Substrate/CompetitorBDBM12658
Meas. Tech.Enzyme Inhibition Assay
Ki 1.6±n/a nM
Citation Kochanny, MJAdler, MEwing, JGriedel, BDHo, EKaranjawala, RLee, WLentz, DLiang, AMMorrissey, MMPhillips, GBPost, JSacchi, KLSakata, STSubramanyam, BVergona, RWalters, JWhite, KAWhitlow, MYe, BZhao, ZShaw, KJ Substituted thiophene-anthranilamides as potent inhibitors of human factor Xa. Bioorg Med Chem15:2127-46 (2007) 
 
Coagulation factor X
Name:Coagulation factor X
Type:Enzyme
Mol. Mass.:54726.60
Organism:Homo sapiens (Human)
Description:n/a
Residue:488
BDBM17248
BDBM12658
NameBDBM17248
Synonyms:3-chloro-N-{4-chloro-2-[(4-chlorophenyl)carbamoyl]phenyl}-4-[(4-ethylpiperazin-1-yl)methyl]thiophene-2-carboxamide | thiophene-containing non-amidine inhibitor, 50
TypeSmall organic molecule
Emp. Form.C25H25Cl3N4O2S
Mol. Mass.551.916
SMILESCCN1CCN(Cc2csc(C(=O)Nc3ccc(Cl)cc3C(=O)Nc3ccc(Cl)cc3)c2Cl)CC1