Reaction Details
TargetCoagulation factor X
LigandBDBM17264
Substrate/CompetitorBDBM12658
Meas. Tech.Enzyme Inhibition Assay
Ki 1.4±n/a nM
Citation Kochanny, MJAdler, MEwing, JGriedel, BDHo, EKaranjawala, RLee, WLentz, DLiang, AMMorrissey, MMPhillips, GBPost, JSacchi, KLSakata, STSubramanyam, BVergona, RWalters, JWhite, KAWhitlow, MYe, BZhao, ZShaw, KJ Substituted thiophene-anthranilamides as potent inhibitors of human factor Xa. Bioorg Med Chem15:2127-46 (2007) 
 
Coagulation factor X
Name:Coagulation factor X
Type:Enzyme
Mol. Mass.:54726.60
Organism:Homo sapiens (Human)
Description:n/a
Residue:488
BDBM17264
BDBM12658
NameBDBM17264
Synonyms:3-chloro-N-{4-chloro-2-[(4-chlorophenyl)carbamoyl]phenyl}-4-(1H-1,2,3-triazol-1-ylmethyl)thiophene-2-carboxamide | thiophene-containing non-amidine inhibitor, 66
TypeSmall organic molecule
Emp. Form.C21H14Cl3N5O2S
Mol. Mass.506.792
SMILESClc1c(Cn2ccnn2)csc1C(=O)Nc1ccc(Cl)cc1C(=O)Nc1ccc(Cl)cc1