Reaction Details
TargetCoagulation factor X
LigandBDBM17269
Substrate/CompetitorBDBM12658
Meas. Tech.Enzyme Inhibition Assay
Ki 0.4±n/a nM
Citation Kochanny, MJAdler, MEwing, JGriedel, BDHo, EKaranjawala, RLee, WLentz, DLiang, AMMorrissey, MMPhillips, GBPost, JSacchi, KLSakata, STSubramanyam, BVergona, RWalters, JWhite, KAWhitlow, MYe, BZhao, ZShaw, KJ Substituted thiophene-anthranilamides as potent inhibitors of human factor Xa. Bioorg Med Chem15:2127-46 (2007) 
 
Coagulation factor X
Name:Coagulation factor X
Type:Enzyme
Mol. Mass.:54726.60
Organism:Homo sapiens (Human)
Description:n/a
Residue:488
BDBM17269
BDBM12658
NameBDBM17269
Synonyms:3-chloro-N-{4-chloro-2-[(4-chlorophenyl)carbamoyl]phenyl}-4-(methanesulfinylmethyl)thiophene-2-carboxamide | thiophene-containing non-amidine inhibitor, 71
TypeSmall organic molecule
Emp. Form.C20H15Cl3N2O3S2
Mol. Mass.501.834
SMILESCS(=O)Cc1csc(C(=O)Nc2ccc(Cl)cc2C(=O)Nc2ccc(Cl)cc2)c1Cl