Reaction Details
TargetPhosphodiesterase
LigandBDBM355364
Substrate/Competitorn/a
Meas. Tech.Fluorescence Polarization (FP) Assay
Ki 0.680±n/a nM
Citation Shen, DMEgbertson, MBerger, RQian, XQian, YHarper, BYang, MGuo, ZZRada, VLWang, DCernak, TASinz, CWang, MWilson, JEXu, S Pyrimidone carboxamide compounds as PDE2 inhibitors US Patent US9815796 Publication Date 11/14/2017
 
Phosphodiesterase
Name:Phosphodiesterase
Type:Enzyme Catalytic Domain
Mol. Mass.:105547.91
Organism:Macaca mulatta (Rhesus macaque)
Description:n/a
Residue:941
BDBM355364
NameBDBM355364
Synonyms:N-{(1R)-2,2-dimethyl-1-[4- (trifluoromethyl)phenyl]propyl}-2- (4-methoxybenzyl)-6-oxo-1,6- dihydropyrimidine-4-carboxamide | US9815796, Example 455
TypeSmall organic molecule
Emp. Form.C25H26F3N3O3
Mol. Mass.473.4874
SMILESCOc1ccc(Cc2nc(cc(=O)[nH]2)C(=O)N[C@@H](c2ccc(cc2)C(F)(F)F)C(C)(C)C)cc1