Reaction Details
TargetcGMP-dependent 3',5'-cyclic phosphodiesterase
LigandBDBM355417
Substrate/Competitorn/a
Meas. Tech.Fluorescence Polarization (FP) Assay
Ki 0.800±n/a nM
Citation Shen, DMEgbertson, MBerger, RQian, XQian, YHarper, BYang, MGuo, ZZRada, VLWang, DCernak, TASinz, CWang, MWilson, JEXu, S Pyrimidone carboxamide compounds as PDE2 inhibitors US Patent US9815796 Publication Date 11/14/2017
 
cGMP-dependent 3',5'-cyclic phosphodiesterase
Name:cGMP-dependent 3',5'-cyclic phosphodiesterase
Type:Enzyme Catalytic Domain
Mol. Mass.:105691.58
Organism:Homo sapiens (Human)
Description:O00408
Residue:941
BDBM355417
NameBDBM355417
Synonyms:2-(3-fluoro-4-methoxybenzyl)-N- {(1R)-1-[3-fluoro-4- (trifluoromethyl)phenyl]-2,2- dimethylpropyl}-6-oxo-1,6- dihydropyrimidine-4-carboxamide | US9815796, Example 508
TypeSmall organic molecule
Emp. Form.C25H24F5N3O3
Mol. Mass.509.4684
SMILESCOc1ccc(Cc2nc(cc(=O)[nH]2)C(=O)N[C@@H](c2ccc(c(F)c2)C(F)(F)F)C(C)(C)C)cc1F