Reaction Details
TargetPhosphodiesterase
LigandBDBM355420
Substrate/Competitorn/a
Meas. Tech.Fluorescence Polarization (FP) Assay
Ki 1.20±n/a nM
Citation Shen, DMEgbertson, MBerger, RQian, XQian, YHarper, BYang, MGuo, ZZRada, VLWang, DCernak, TASinz, CWang, MWilson, JEXu, S Pyrimidone carboxamide compounds as PDE2 inhibitors US Patent US9815796 Publication Date 11/14/2017
 
Phosphodiesterase
Name:Phosphodiesterase
Type:Enzyme Catalytic Domain
Mol. Mass.:105547.91
Organism:Macaca mulatta (Rhesus macaque)
Description:n/a
Residue:941
BDBM355420
NameBDBM355420
Synonyms:2-(3-fluoro-4-methoxybenzyl)-N- [(1R)-2-methyl-1-{4- [(trifluoromethyl)sulfanyl]phenyl} propyl]-6-oxo-1,6- dihydropyrimidine-4-carboxamide | US9815796, Example 511
TypeSmall organic molecule
Emp. Form.C24H23F4N3O3S
Mol. Mass.509.516
SMILESCOc1ccc(Cc2nc(cc(=O)[nH]2)C(=O)N[C@H](C(C)C)c2ccc(SC(F)(F)F)cc2)cc1F