Reaction Details
TargetRho-associated protein kinase 1
LigandBDBM322152
Substrate/Competitorn/a
Meas. Tech.Kinase Inhibition Assay
Ki 70.0±n/a nM
Citation Poyurovsky, MKim, JLiu, KZanin-Zhorov, A Rho kinase inhibitors US Patent US9815820 Publication Date 11/14/2017
 
Rho-associated protein kinase 1
Name:Rho-associated protein kinase 1
Type:Serine/threonine-protein kinase
Mol. Mass.:158156.77
Organism:Homo sapiens (Human)
Description:Q13464
Residue:1354
BDBM322152
NameBDBM322152
Synonyms:(R)-2-(3-(4-((1H-indazol-5-yl)amino)pyrimidin-2-yl)phenoxy)-N-(pyrrolidin-3-yl)acetamide HCl salt US10696660, Example 12 US9815820, ex. 13
TypeSmall organic molecule
Emp. Form.C23H23N7O2
Mol. Mass.429.4744
SMILESO=C(COc1cccc(c1)-c1nccc(Nc2ccc3[nH]ncc3c2)n1)N[C@@H]1CCNC1