Reaction Details
TargetRho-associated protein kinase 1
LigandBDBM355727
Substrate/Competitorn/a
Meas. Tech.Kinase Inhibition Assay
Ki 40.0±n/a nM
Citation Poyurovsky, MKim, JLiu, KZanin-Zhorov, A Rho kinase inhibitors US Patent US9815820 Publication Date 11/14/2017
 
Rho-associated protein kinase 1
Name:Rho-associated protein kinase 1
Type:Serine/threonine-protein kinase
Mol. Mass.:158156.77
Organism:Homo sapiens (Human)
Description:Q13464
Residue:1354
BDBM355727
NameBDBM355727
Synonyms:US9815820, Y-27263
TypeSmall organic molecule
Emp. Form.C15H22N2O
Mol. Mass.246.348
SMILESCC(C)[C@H]1CC[C@@H](CC1)C(=O)Nc1ccncc1