Reaction Details
TargetCoagulation factor X
LigandBDBM17277
Substrate/CompetitorBDBM12658
Meas. Tech.Enzyme Inhibition Assay
pH7.5±n/a
Temperature295.15±n/a K
Ki 0.66±n/a nM
Citation Whitlow, MArnaiz, DOBuckman, BODavey, DDGriedel, BGuilford, WJKoovakkat, SKLiang, AMohan, RPhillips, GBSeto, MShaw, KJXu, WZhao, ZLight, DRMorrissey, MM Crystallographic analysis of potent and selective factor Xa inhibitors complexed to bovine trypsin. Acta Crystallogr D Biol Crystallogr55:1395-404 (1999) 
 
Coagulation factor X
Name:Coagulation factor X
Type:Enzyme
Mol. Mass.:54726.60
Organism:Homo sapiens (Human)
Description:n/a
Residue:488
BDBM17277
BDBM12658
NameBDBM17277
Synonyms:(Z,Z)BABCH CHEMBL55035
TypeSmall organic molecule
Emp. Form.C23H24N4O
Mol. Mass.372.4629
SMILESNC(=N)c1ccc(\C=C2\CCCC\C(=C\c3ccc(cc3)C(N)=N)C2=O)cc1