Reaction Details
TargetCoagulation factor X
LigandBDBM17283
Substrate/CompetitorBDBM12658
Meas. Tech.Enzyme Inhibition Assay
pH7.5±n/a
Temperature295.15±n/a K
Ki 20±n/a nM
Citation Whitlow, MArnaiz, DOBuckman, BODavey, DDGriedel, BGuilford, WJKoovakkat, SKLiang, AMohan, RPhillips, GBSeto, MShaw, KJXu, WZhao, ZLight, DRMorrissey, MM Crystallographic analysis of potent and selective factor Xa inhibitors complexed to bovine trypsin. Acta Crystallogr D Biol Crystallogr55:1395-404 (1999) 
 
Coagulation factor X
Name:Coagulation factor X
Type:Enzyme
Mol. Mass.:54726.60
Organism:Homo sapiens (Human)
Description:n/a
Residue:488
BDBM17283
BDBM12658
NameBDBM17283
Synonyms:(2S)-3-(7-carbamimidoylnaphthalen-2-yl)-2-(4-{[(3S)-1-ethanimidoylpyrrolidin-3-yl]oxy}phenyl)propanoic acid DX-9065a
TypeSmall organic molecule
Emp. Form.C26H28N4O3
Mol. Mass.444.5255
SMILESCC(=N)N1CC[C@@H](C1)Oc1ccc(cc1)[C@H](Cc1ccc2ccc(cc2c1)C(N)=N)C(O)=O