Reaction Details
TargetBeta-secretase 1
LigandBDBM230876
Substrate/Competitorn/a
Meas. Tech.BACE1 Binding Assay
pH4.5±n/a
Temperature298.15±n/a K
Ki 6.10±n/a nM
Commentsextracted
Citation Juhl, KTagmose, LMarigo, M 2-amino-6-(difluoromethyl)-5,5-difluoro-6-phenyl-3,4,5,6-tetrahydropyridines as BACE1 inhibitors US Patent US10045974 Publication Date 8/14/2018
 
Beta-secretase 1
Name:Beta-secretase 1
Type:Protein
Mol. Mass.:55755.10
Organism:Homo sapiens (Human)
Description:P56817
Residue:501
BDBM230876
NameBDBM230876
Synonyms:US10045974, 12 US9346797, 12
TypeSmall organic molecule
Emp. Form.C18H14BrF5N4O
Mol. Mass.477.226
SMILESNC1=N[C@](C(F)F)(c2cc(NC(=O)c3ccc(Br)cn3)ccc2F)C(F)(F)CC1