Reaction Details
TargetSerine protease 1
LigandBDBM17295
Substrate/CompetitorBDBM17296
Meas. Tech.Determination of Inhibition Constants
pH8±n/a
Temperature310.15±n/a K
Ki 110±5 nM
Citation Nar, HBauer, MSchmid, AStassen, JMWienen, WPriepke, HWKauffmann, IKRies, UJHauel, NH Structural basis for inhibition promiscuity of dual specific thrombin and factor Xa blood coagulation inhibitors. Structure9:29-37 (2001) 
 
Serine protease 1
Name:Serine protease 1
Type:Enzyme
Mol. Mass.:25790.52
Organism:Bos taurus (bovine)
Description:P00760
Residue:246
BDBM17295
BDBM17296
NameBDBM17295
Synonyms:BIBT0871 | ethyl 2-{[(E)-{[1-(2-{[(4-carbamimidoylphenyl)amino]methyl}-1-methyl-1H-1,3-benzodiazol-5-yl)cyclopropyl](pyridin-2-yl)methylidene}amino]oxy}acetate
TypeSmall organic molecule
Emp. Form.C29H31N7O3
Mol. Mass.525.6015
SMILESCCOC(=O)CO\N=C(\c1ccccn1)C1(CC1)c1ccc2n(C)c(CNc3ccc(cc3)C(N)=N)nc2c1