Reaction Details
TargetCoagulation factor XI
LigandBDBM17295
Substrate/CompetitorBDBM17296
Meas. Tech.Determination of Inhibition Constants
pH8±n/a
Temperature310.15±n/a K
Ki 9000±n/a nM
Citation Nar, HBauer, MSchmid, AStassen, JMWienen, WPriepke, HWKauffmann, IKRies, UJHauel, NH Structural basis for inhibition promiscuity of dual specific thrombin and factor Xa blood coagulation inhibitors. Structure9:29-37 (2001) 
 
Coagulation factor XI
Name:Coagulation factor XI
Type:Enzyme
Mol. Mass.:70130.58
Organism:Homo sapiens (Human)
Description:P03951
Residue:625
BDBM17295
BDBM17296
NameBDBM17295
Synonyms:BIBT0871 | ethyl 2-{[(E)-{[1-(2-{[(4-carbamimidoylphenyl)amino]methyl}-1-methyl-1H-1,3-benzodiazol-5-yl)cyclopropyl](pyridin-2-yl)methylidene}amino]oxy}acetate
TypeSmall organic molecule
Emp. Form.C29H31N7O3
Mol. Mass.525.6015
SMILESCCOC(=O)CO\N=C(\c1ccccn1)C1(CC1)c1ccc2n(C)c(CNc3ccc(cc3)C(N)=N)nc2c1