Reaction Details
TargetTissue-type plasminogen activator
LigandBDBM17297
Substrate/CompetitorBDBM17296
Meas. Tech.Determination of Inhibition Constants
pH8±n/a
Temperature310.15±n/a K
Ki>50000±n/a nM
Citation Nar, HBauer, MSchmid, AStassen, JMWienen, WPriepke, HWKauffmann, IKRies, UJHauel, NH Structural basis for inhibition promiscuity of dual specific thrombin and factor Xa blood coagulation inhibitors. Structure9:29-37 (2001) 
 
Tissue-type plasminogen activator
Name:Tissue-type plasminogen activator
Type:Enzyme
Mol. Mass.:62931.08
Organism:Homo sapiens (Human)
Description:n/a
Residue:562
BDBM17297
BDBM17296
NameBDBM17297
Synonyms:4-[({1-methyl-5-[(2-methyl-1H-1,3-benzodiazol-1-yl)methyl]-1H-1,3-benzodiazol-2-yl}methyl)amino]benzene-1-carboximidamide | BIBR1109
TypeSmall organic molecule
Emp. Form.C25H25N7
Mol. Mass.423.5129
SMILESCc1nc2ccccc2n1Cc1ccc2n(C)c(CNc3ccc(cc3)C(N)=N)nc2c1